BDBM50185846 7-hydroxy-9a-isopropyl-4-methyl-1,2,9,9a-tetrahydrofluoren-3-one::CHEMBL212419
SMILES CC(C)C12Cc3cc(O)ccc3C1=C(C)C(=O)CC2
InChI Key InChIKey=MBDRSPSBVPDEDE-UHFFFAOYSA-N
Data  2 IC50
  Tab Delimited (TSV)   2D SDfile   Computed 3D by Vconf -m prep SDfile
Find this compound or compounds like it in BindingDB:
Activity Spreadsheet -- Enzyme Inhibition Constant Data from BindingDB
Found 2 hits for monomerid = 50185846
TargetEstrogen receptor beta(Homo sapiens (Human))
Merck Research Laboratories
Curated by ChEMBL
LigandPNGBDBM50185846(7-hydroxy-9a-isopropyl-4-methyl-1,2,9,9a-tetrahydr...)
Affinity DataIC50:  123nM. Assay description: Binding affinity to ERbeta by scintillation proximity assay
In DepthDetails ArticlePubMed
TargetEstrogen receptor(Homo sapiens (Human))
Merck Research Laboratories
Curated by ChEMBL
LigandPNGBDBM50185846(7-hydroxy-9a-isopropyl-4-methyl-1,2,9,9a-tetrahydr...)
Affinity DataIC50:  1.42E+3nM. Assay description: Binding affinity to ERalpha by scintillation proximity assay
In DepthDetails ArticlePubMed