BDBM50185854 7-hydroxy-9a-methyl-1,2,9,9a-tetrahydrofluoren-3-one::CHEMBL211599
SMILES CC12Cc3cc(O)ccc3C1=CC(=O)CC2
InChI Key InChIKey=ULUAXMXCRVOEKK-UHFFFAOYSA-N
Data  2 IC50
  Tab Delimited (TSV)   2D SDfile   Computed 3D by Vconf -m prep SDfile
Find this compound or compounds like it in BindingDB:
Activity Spreadsheet -- Enzyme Inhibition Constant Data from BindingDB
Found 2 hits for monomerid = 50185854
TargetEstrogen receptor(Homo sapiens (Human))
Merck Research Laboratories
Curated by ChEMBL
LigandPNGBDBM50185854(7-hydroxy-9a-methyl-1,2,9,9a-tetrahydrofluoren-3-o...)
Affinity DataIC50:  4.25E+3nM. Assay description: Binding affinity to ERalpha by scintillation proximity assay
In DepthDetails ArticlePubMed
TargetEstrogen receptor beta(Homo sapiens (Human))
Merck Research Laboratories
Curated by ChEMBL
LigandPNGBDBM50185854(7-hydroxy-9a-methyl-1,2,9,9a-tetrahydrofluoren-3-o...)
Affinity DataIC50:  936nM. Assay description: Binding affinity to ERbeta by scintillation proximity assay
In DepthDetails ArticlePubMed