BDBM50186226 3-((4-(2-(2,3-dichloro-4-(2-methylenebutanoyl)phenoxy)acetamido)butanamido)methyl)benzamide::CHEMBL212517
SMILES CCC(=C)C(=O)c1ccc(OCC(=O)NCCCC(=O)NCc2cccc(c2)C(N)=O)c(Cl)c1Cl
InChI Key InChIKey=MUYUWUWMFGWOBW-UHFFFAOYSA-N
Data  2 IC50
  Tab Delimited (TSV)   2D SDfile   Computed 3D by Vconf -m prep SDfile
Find this compound or compounds like it in BindingDB:
Activity Spreadsheet -- Enzyme Inhibition Constant Data from BindingDB
Found 2 hits for monomerid = 50186226
TargetGlutathione S-transferase A1(Homo sapiens (Human))
Syntrix Biosytems
Curated by ChEMBL
LigandPNGBDBM50186226(3-((4-(2-(2,3-dichloro-4-(2-methylenebutanoyl)phen...)
Affinity DataIC50:  1.39E+4nM. Assay description: Inhibition of GST A1-1
In DepthDetails ArticlePubMed
TargetGlutathione S-transferase P(Homo sapiens (Human))
Syntrix Biosytems
Curated by ChEMBL
LigandPNGBDBM50186226(3-((4-(2-(2,3-dichloro-4-(2-methylenebutanoyl)phen...)
Affinity DataIC50:  1.50E+4nM. Assay description: Inhibition of GST P1-1
In DepthDetails ArticlePubMed