BDBM50186228 3,5-bis((2-(2,3-dichloro-4-(2-methylenebutanoyl)phenoxy)acetamido)methyl)benzamide::CHEMBL212097
SMILES CCC(=C)C(=O)c1ccc(OCC(=O)NCc2cc(CNC(=O)COc3ccc(C(=O)C(=C)CC)c(Cl)c3Cl)cc(c2)C(N)=O)c(Cl)c1Cl
InChI Key InChIKey=QONBNYTUVRQCDJ-UHFFFAOYSA-N
Data  2 IC50
  Tab Delimited (TSV)   2D SDfile   Computed 3D by Vconf -m prep SDfile
Find this compound or compounds like it in BindingDB:
Activity Spreadsheet -- Enzyme Inhibition Constant Data from BindingDB
Found 2 hits for monomerid = 50186228
TargetGlutathione S-transferase A1(Homo sapiens (Human))
Syntrix Biosytems
Curated by ChEMBL
LigandPNGBDBM50186228(3,5-bis((2-(2,3-dichloro-4-(2-methylenebutanoyl)ph...)
Affinity DataIC50:  32.7nM. Assay description: Inhibition of GST A1-1
In DepthDetails ArticlePubMed
TargetGlutathione S-transferase P(Homo sapiens (Human))
Syntrix Biosytems
Curated by ChEMBL
LigandPNGBDBM50186228(3,5-bis((2-(2,3-dichloro-4-(2-methylenebutanoyl)ph...)
Affinity DataIC50:  992nM. Assay description: Inhibition of GST P1-1
In DepthDetails ArticlePubMed