BDBM50186282 2-(phenylsulfonyl)-8-(3-(piperidin-1-yl)propoxy)-1,2,3,4-tetrahydroisoquinoline::CHEMBL378760
SMILES O=S(=O)(N1CCc2cccc(OCCCN3CCCCC3)c2C1)c1ccccc1
InChI Key InChIKey=KDYSCWPJIYCMAX-UHFFFAOYSA-N
Data  1 KI
  Tab Delimited (TSV)   2D SDfile   Computed 3D by Vconf -m prep SDfile
Find this compound or compounds like it in BindingDB:
Activity Spreadsheet -- Enzyme Inhibition Constant Data from BindingDB
Found 1 hit for monomerid = 50186282
TargetHistamine H3 receptor(Homo sapiens (Human))
Eli Lilly
Curated by ChEMBL
LigandPNGBDBM50186282(2-(phenylsulfonyl)-8-(3-(piperidin-1-yl)propoxy)-1...)
Affinity DataKi: >300nM. Assay description: Displacement of [3H]N-alpha-methylhistamine from human cloned H3 receptor
In DepthDetails ArticlePubMed