BDBM50186315 8-(3-(piperidin-1-yl)propoxy)-1,2,3,4-tetrahydroisoquinoline::CHEMBL211517
SMILES C(COc1cccc2CCNCc12)CN1CCCCC1
InChI Key InChIKey=PXQCAXZFWWDUAL-UHFFFAOYSA-N
Data  1 KI
  Tab Delimited (TSV)   2D SDfile   Computed 3D by Vconf -m prep SDfile
Find this compound or compounds like it in BindingDB:
Activity Spreadsheet -- Enzyme Inhibition Constant Data from BindingDB
Found 1 hit for monomerid = 50186315
TargetHistamine H3 receptor(Homo sapiens (Human))
Eli Lilly
Curated by ChEMBL
LigandPNGBDBM50186315(8-(3-(piperidin-1-yl)propoxy)-1,2,3,4-tetrahydrois...)
Affinity DataKi:  154nM. Assay description: Displacement of [3H]N-alpha-methylhistamine from human cloned H3 receptor
In DepthDetails ArticlePubMed