BDBM50186762 CHEMBL427392::[1,1':4',1'']Terphenyl-4,3'',5''-triol::[1,1';4',1'']-terphenyl-4,3'',5''-triol
SMILES Oc1ccc(cc1)-c1ccc(cc1)-c1cc(O)cc(O)c1
InChI Key InChIKey=DADMQAUVBPTTDT-UHFFFAOYSA-N
Data  2 IC50
  Tab Delimited (TSV)   2D SDfile   Computed 3D by Vconf -m prep SDfile
Find this compound or compounds like it in BindingDB:
Activity Spreadsheet -- Enzyme Inhibition Constant Data from BindingDB
Found 2 hits for monomerid = 50186762
TargetBreakpoint cluster region protein/Tyrosine-protein kinase ABL1(Homo sapiens (Human))
Universit£
Curated by ChEMBL
LigandPNGBDBM50186762(CHEMBL427392 | [1,1':4',1'']Terphenyl-4,3'',5''-tr...)
Affinity DataIC50:  2.00E+4nM. Assay description: Antiproliferative activity against human K562 cell line expressing Bcr-Abl
In DepthDetails ArticlePubMed
TargetATP-dependent translocase ABCB1(Homo sapiens (Human))
Universit£
Curated by ChEMBL
LigandPNGBDBM50186762(CHEMBL427392 | [1,1':4',1'']Terphenyl-4,3'',5''-tr...)
Affinity DataIC50:  2.30E+4nM. Assay description: Antiproliferative activity against MDR human HL60R cell line
In DepthDetails ArticlePubMed