BDBM50187068 CHEMBL209149::diethyl 4-(3-bromo-4-methylphenylamino)quinoline-3,6-dicarboxylate
SMILES CCOC(=O)c1ccc2ncc(C(=O)OCC)c(Nc3ccc(C)c(Br)c3)c2c1
InChI Key InChIKey=IFNSWWMCNCFUKV-UHFFFAOYSA-N
Data  1 IC50
  Tab Delimited (TSV)   2D SDfile   Computed 3D by Vconf -m prep SDfile
Find this compound or compounds like it in BindingDB:
Activity Spreadsheet -- Enzyme Inhibition Constant Data from BindingDB
Found 1 hit for monomerid = 50187068
TargetDual specificity tyrosine-phosphorylation-regulated kinase 1A(Mus musculus)
Research Center Idrtech
Curated by ChEMBL
LigandPNGBDBM50187068(CHEMBL209149 | diethyl 4-(3-bromo-4-methylphenylam...)
Affinity DataIC50:  5.00E+4nM. Assay description: Inhibition of mouse Dyrk1A autophosphorylation in HEk293 cells
In DepthDetails ArticlePubMed