BDBM50187169 (S)-benzyl 1-(5-(4-((2-(4-fluorophenoxy)ethyl)carbamoyl)benzyl)-1,2,4-oxadiazol-3-yl)-6-amino-1-oxohexan-2-ylcarbamate::CHEMBL214367
SMILES NCCCC[C@H](NC(=O)OCc1ccccc1)C(=O)c1noc(Cc2ccc(cc2)C(=O)NCCOc2ccc(F)cc2)n1
InChI Key InChIKey=MLWLRPHVDMLHHG-MHZLTWQESA-N
Data  1 KI
  Tab Delimited (TSV)   2D SDfile   Computed 3D by Vconf -m prep SDfile
Find this compound or compounds like it in BindingDB:
Activity Spreadsheet -- Enzyme Inhibition Constant Data from BindingDB
Found 1 hit for monomerid = 50187169
TargetDimer of Tryptase beta-2(Homo sapiens (Human))
Celera
Curated by ChEMBL
LigandPNGBDBM50187169((S)-benzyl 1-(5-(4-((2-(4-fluorophenoxy)ethyl)carb...)
Affinity DataKi:  2.90nM. Assay description: Inhibition of human beta tryptase
In DepthDetails ArticlePubMed