BDBM50187177 CHEMBL212774::N-[(2S)-6-amino-1-{5-[(4-{[2-(3-chlorophenyl)ethyl]carbamoyl}phenyl)methyl]-1,2,4-oxadiazol-3-yl}-1-oxohexan-2-yl]-3-fluorobenzamide
SMILES NCCCC[C@H](NC(=O)c1cccc(F)c1)C(=O)c1noc(Cc2ccc(cc2)C(=O)NCCc2cccc(Cl)c2)n1
InChI Key InChIKey=RFHHWPRQNRHMMZ-SANMLTNESA-N
Data  1 KI
  Tab Delimited (TSV)   2D SDfile   Computed 3D by Vconf -m prep SDfile
Find this compound or compounds like it in BindingDB:
Activity Spreadsheet -- Enzyme Inhibition Constant Data from BindingDB
Found 1 hit for monomerid = 50187177
TargetDimer of Tryptase beta-2(Homo sapiens (Human))
Celera
Curated by ChEMBL
LigandPNGBDBM50187177(CHEMBL212774 | N-[(2S)-6-amino-1-{5-[(4-{[2-(3-chl...)
Affinity DataKi:  1.70nM. Assay description: Inhibition of human beta tryptase
In DepthDetails ArticlePubMed