BDBM50187180 (S)-benzyl 1-(5-(4-((3,4-dichlorophenethyl)carbamoyl)benzyl)-1,2,4-oxadiazol-3-yl)-6-amino-1-oxohexan-2-ylcarbamate::CHEMBL379486
SMILES NCCCC[C@H](NC(=O)OCc1ccccc1)C(=O)c1noc(Cc2ccc(cc2)C(=O)NCCc2ccc(Cl)c(Cl)c2)n1
InChI Key InChIKey=MBBNKWIBPSNEBE-MHZLTWQESA-N
Data  1 KI
  Tab Delimited (TSV)   2D SDfile   Computed 3D by Vconf -m prep SDfile
Find this compound or compounds like it in BindingDB:
Activity Spreadsheet -- Enzyme Inhibition Constant Data from BindingDB
Found 1 hit for monomerid = 50187180
TargetDimer of Tryptase beta-2(Homo sapiens (Human))
Celera
Curated by ChEMBL
LigandPNGBDBM50187180((S)-benzyl 1-(5-(4-((3,4-dichlorophenethyl)carbamo...)
Affinity DataKi:  16nM. Assay description: Inhibition of human beta tryptase
In DepthDetails ArticlePubMed