BDBM50187264 (2R,5S)-1-(2-(2,3,3-trimethylbutan-2-ylamino)acetyl)pyrrolidine-2,5-dicarbonitrile::CHEMBL378712
SMILES CC(C)(C)C(C)(C)NCC(=O)N1[C@@H](CC[C@@H]1C#N)C#N
InChI Key InChIKey=FVCOEIQVERWYQQ-TXEJJXNPSA-N
Data  1 IC50
  Tab Delimited (TSV)   2D SDfile   Computed 3D by Vconf -m prep SDfile
Find this compound or compounds like it in BindingDB:
Activity Spreadsheet -- Enzyme Inhibition Constant Data from BindingDB
Found 1 hit for monomerid = 50187264
TargetDipeptidyl peptidase 4(Homo sapiens (Human))
Pfizer
Curated by ChEMBL
LigandPNGBDBM50187264((2R,5S)-1-(2-(2,3,3-trimethylbutan-2-ylamino)acety...)
Affinity DataIC50: >3.00E+3nM. Assay description: Inhibition of human recombinant DPP4
In DepthDetails ArticlePubMed