BDBM50187270 (2R,5R)-1-[2-(adamantan-1-ylamino)-acetyl]-pyrrolidine-2,5-dicarbonitrile::CHEMBL379500
SMILES O=C(CNC12CC3CC(CC(C3)C1)C2)N1[C@H](CC[C@@H]1C#N)C#N
InChI Key InChIKey=RJTYGLCTQWLNAN-HYXCCBOESA-N
Data  1 IC50
  Tab Delimited (TSV)   2D SDfile   Computed 3D by Vconf -m prep SDfile
Find this compound or compounds like it in BindingDB:
Activity Spreadsheet -- Enzyme Inhibition Constant Data from BindingDB
Found 1 hit for monomerid = 50187270
TargetDipeptidyl peptidase 4(Homo sapiens (Human))
Pfizer
Curated by ChEMBL
LigandPNGBDBM50187270((2R,5R)-1-[2-(adamantan-1-ylamino)-acetyl]-pyrroli...)
Affinity DataIC50: >3.00E+4nM. Assay description: Inhibition of human recombinant DPP4
In DepthDetails ArticlePubMed