BDBM50187280 (2R,5S)-1-(2-(1-methylcyclohexylamino)acetyl)pyrrolidine-2,5-dicarbonitrile::CHEMBL377058
SMILES CC1(CCCCC1)NCC(=O)N1[C@@H](CC[C@@H]1C#N)C#N
InChI Key InChIKey=JNXUTOXLAZWYBQ-BETUJISGSA-N
Data  1 IC50
  Tab Delimited (TSV)   2D SDfile   Computed 3D by Vconf -m prep SDfile
Find this compound or compounds like it in BindingDB:
Activity Spreadsheet -- Enzyme Inhibition Constant Data from BindingDB
Found 1 hit for monomerid = 50187280
TargetDipeptidyl peptidase 4(Homo sapiens (Human))
Pfizer
Curated by ChEMBL
LigandPNGBDBM50187280((2R,5S)-1-(2-(1-methylcyclohexylamino)acetyl)pyrro...)
Affinity DataIC50:  689nM. Assay description: Inhibition of human recombinant DPP4
In DepthDetails ArticlePubMed