BDBM50187572 4-(3-(benzyloxy)benzylidene)-1-(3,4-dichlorophenyl)pyrazolidine-3,5-dione::BAS-00672722::CHEMBL207360
SMILES Clc1ccc(cc1Cl)N1NC(=O)C(=Cc2cccc(OCc3ccccc3)c2)C1=O
InChI Key InChIKey=OSJPWEILZQFNPI-UHFFFAOYSA-N
Data  2 KI
  Tab Delimited (TSV)   2D SDfile   Computed 3D by Vconf -m prep SDfile
Find this compound or compounds like it in BindingDB:
Activity Spreadsheet -- Enzyme Inhibition Constant Data from BindingDB
Found 2 hits for monomerid = 50187572
TargetTyrosine-protein kinase ABL1(Homo sapiens (Human))
Università
Curated by ChEMBL
LigandPNGBDBM50187572(4-(3-(benzyloxy)benzylidene)-1-(3,4-dichlorophenyl...)
Affinity DataKi:  1.00E+3nM. Assay description: Binding affinity to human recombinant Abl
In DepthDetails ArticlePubMed
TargetProto-oncogene tyrosine-protein kinase Src(Homo sapiens (Human))
Università
Curated by ChEMBL
LigandPNGBDBM50187572(4-(3-(benzyloxy)benzylidene)-1-(3,4-dichlorophenyl...)
Affinity DataKi:  5.40E+3nM. Assay description: Binding affinity to human recombinant Src
In DepthDetails ArticlePubMed