BDBM50188280 4-((3-(thiophen-3-yl)-1,4-dihydroindeno[1,2-c]pyrazol-7-yl)methyl)piperazine-1-carbaldehyde::CHEMBL211089
SMILES O=CN1CCN(Cc2ccc3Cc4c(n[nH]c4-c4ccsc4)-c3c2)CC1
InChI Key InChIKey=LUMQCGDNXRKUGI-UHFFFAOYSA-N
Data  1 IC50
  Tab Delimited (TSV)   2D SDfile   Computed 3D by Vconf -m prep SDfile
Find this compound or compounds like it in BindingDB:
Activity Spreadsheet -- Enzyme Inhibition Constant Data from BindingDB
Found 1 hit for monomerid = 50188280
TargetVascular endothelial growth factor receptor 2(Homo sapiens (Human))
Abbott Laboratories
Curated by ChEMBL
LigandPNGBDBM50188280(4-((3-(thiophen-3-yl)-1,4-dihydroindeno[1,2-c]pyra...)
Affinity DataIC50:  6.65E+5nM. Assay description: Inhibition of VEGF-induced human KDR phosphorylation transfected in NIH3T3 cells by ELISA
In DepthDetails ArticlePubMed