BDBM50188422 CHEMBL209712::N-(2-[5-methoxy-1-methyl-1H-indol-3-yl]-2,2-dimethyleneethyl)butanamide
SMILES CCCC(=O)NCC1(CC1)c1cn(C)c2ccc(OC)cc12
InChI Key InChIKey=GIVWHZIVPDPHPL-UHFFFAOYSA-N
Data  2 KI
  Tab Delimited (TSV)   2D SDfile   Computed 3D by Vconf -m prep SDfile
Find this compound or compounds like it in BindingDB:
Activity Spreadsheet -- Enzyme Inhibition Constant Data from BindingDB
Found 2 hits for monomerid = 50188422
TargetMelatonin receptor type 1B(Homo sapiens (Human))
University Of Athens
Curated by ChEMBL
LigandPNGBDBM50188422(CHEMBL209712 | N-(2-[5-methoxy-1-methyl-1H-indol-3...)
Affinity DataKi:  7.5nM. Assay description: Displacement of 2-[125I]iodomelatonin from human recombinant MT2 receptor expressed in NIH3T3 cells
In DepthDetails ArticlePubMed
TargetMelatonin receptor type 1A(Homo sapiens (Human))
University Of Athens
Curated by ChEMBL
LigandPNGBDBM50188422(CHEMBL209712 | N-(2-[5-methoxy-1-methyl-1H-indol-3...)
Affinity DataKi:  212nM. Assay description: Displacement of 2-[125I]iodomelatonin from human recombinant MT1 receptor expressed in NIH3T3 cells
In DepthDetails ArticlePubMed