BDBM50188936 CHEMBL213127::N-(4-bromophenethyl)-5-(2-(methylamino)pyrimidin-4-yl)thiophene-2-carboxamide
SMILES CNc1nccc(n1)-c1ccc(s1)C(=O)NCCc1ccc(Br)cc1
InChI Key InChIKey=GMHIHHJFPKGLTE-UHFFFAOYSA-N
Data  1 IC50
  Tab Delimited (TSV)   2D SDfile   Computed 3D by Vconf -m prep SDfile
Find this compound or compounds like it in BindingDB:
Activity Spreadsheet -- Enzyme Inhibition Constant Data from BindingDB
Found 1 hit for monomerid = 50188936
TargetRAC-gamma serine/threonine-protein kinase(Homo sapiens (Human))
Chiron
Curated by ChEMBL
LigandPNGBDBM50188936(CHEMBL213127 | N-(4-bromophenethyl)-5-(2-(methylam...)
Affinity DataIC50:  2.60E+3nM. Assay description: Inhibition of AKT3 in presence of 0.2 uM ATP
In DepthDetails ArticlePubMed