BDBM50189180 CHEMBL3827257::US9597326, Compound 18
SMILES Cc1cc(OCCOCCOCCC(F)(F)P(O)(O)=O)ccc1CCc1cnc2c(N)nc3cc(CCC(O)=O)ccc3c2c1
InChI Key InChIKey=GYHWHZCJAIQDOJ-UHFFFAOYSA-N
Data  4 EC50
  Tab Delimited (TSV)   2D SDfile   Computed 3D by Vconf -m prep SDfile
Find this compound or compounds like it in BindingDB:
Activity Spreadsheet -- Enzyme Inhibition Constant Data from BindingDB
Found 4 hits for monomerid = 50189180
TargetToll-like receptor 7(Homo sapiens (Human))
Genomics Institute Of Novartis Research Foundation
Curated by ChEMBL
LigandPNGBDBM50189180(CHEMBL3827257 | US9597326, Compound 18)
Affinity DataEC50:  39nM. Assay description: Agonist activity at human TLR7 expressed in HEK293 cells incubated for 6 hrs by luciferase reporter gene assay
In DepthDetails ArticlePubMed
TargetToll-like receptor 7(Homo sapiens (Human))
Genomics Institute Of Novartis Research Foundation
Curated by ChEMBL
LigandPNGBDBM50189180(CHEMBL3827257 | US9597326, Compound 18)
Affinity DataEC50:  5nM. Assay description: Human embryonic kidney 293 (HEK 293) cells were stably transfected with human TLR7 and an NF-kB-driven luciferase reporter vector (pNifty-Luciferase)...
In DepthDetails US Patent
TargetToll-like receptor 7(Homo sapiens (Human))
Genomics Institute Of Novartis Research Foundation
Curated by ChEMBL
LigandPNGBDBM50189180(CHEMBL3827257 | US9597326, Compound 18)
Affinity DataEC50:  2.10E+3nM. Assay description: Agonist activity at TLR7 in human PBMC assessed as induction of IL-6 secretion in supernatant after 18 hrs
In DepthDetails ArticlePubMed
TargetToll-like receptor 7(Mus musculus)
Genomics Institute Of Novartis Research Foundation
Curated by ChEMBL
LigandPNGBDBM50189180(CHEMBL3827257 | US9597326, Compound 18)
Affinity DataEC50:  1.20E+3nM. Assay description: Agonist activity at TLR7 in Balb/c mouse splenocytes assessed as induction of IL-6 secretion in supernatant after 18 hrs
In DepthDetails ArticlePubMed