BDBM50189283 CHEMBL3828542::US9597326, Compound 6
SMILES Cc1ccc2c(c1)nc(N)c1ncc(CCc3ccc(OCCOCCOCCC(F)(F)P(O)(O)=O)cc3C)cc21
InChI Key InChIKey=BKWUSNSMJRGORT-UHFFFAOYSA-N
Data  4 EC50
  Tab Delimited (TSV)   2D SDfile   Computed 3D by Vconf -m prep SDfile
Find this compound or compounds like it in BindingDB:
Activity Spreadsheet -- Enzyme Inhibition Constant Data from BindingDB
Found 4 hits for monomerid = 50189283
TargetToll-like receptor 7(Homo sapiens (Human))
Genomics Institute Of Novartis Research Foundation
Curated by ChEMBL
LigandPNGBDBM50189283(CHEMBL3828542 | US9597326, Compound 6)
Affinity DataEC50:  1.20E+3nM. Assay description: Agonist activity at human TLR7 expressed in HEK293 cells incubated for 6 hrs by luciferase reporter gene assay
In DepthDetails ArticlePubMed
TargetToll-like receptor 7(Homo sapiens (Human))
Genomics Institute Of Novartis Research Foundation
Curated by ChEMBL
LigandPNGBDBM50189283(CHEMBL3828542 | US9597326, Compound 6)
Affinity DataEC50:  1.64E+3nM. Assay description: Human embryonic kidney 293 (HEK 293) cells were stably transfected with human TLR7 and an NF-kB-driven luciferase reporter vector (pNifty-Luciferase)...
In DepthDetails US Patent
TargetToll-like receptor 7(Homo sapiens (Human))
Genomics Institute Of Novartis Research Foundation
Curated by ChEMBL
LigandPNGBDBM50189283(CHEMBL3828542 | US9597326, Compound 6)
Affinity DataEC50:  980nM. Assay description: Agonist activity at TLR7 in human PBMC assessed as induction of IL-6 secretion in supernatant after 18 hrs
In DepthDetails ArticlePubMed
TargetToll-like receptor 7(Mus musculus)
Genomics Institute Of Novartis Research Foundation
Curated by ChEMBL
LigandPNGBDBM50189283(CHEMBL3828542 | US9597326, Compound 6)
Affinity DataEC50:  810nM. Assay description: Agonist activity at TLR7 in Balb/c mouse splenocytes assessed as induction of IL-6 secretion in supernatant after 18 hrs
In DepthDetails ArticlePubMed