BDBM50190132 CHEMBL3828225
SMILES [#6]\[#6](-[#6])=[#6]\[#6]-[#6]\[#6](-[#6])=[#6]\[#6]-[#6@@H]1-[#6][C@@]2([#6]\[#6]=[#6](\[#6])-[#6])[#6](-[#8])=[#6](-[#6]-c3ccc(-[#8])c(-[#8])c3)-[#6](=O)[C@]([#6]\[#6]=[#6](\[#6])-[#6])([#6]2=O)[C@@]1([#6])[#6]-[#6]\[#6]=[#6](\[#6])-[#6]
InChI Key InChIKey=DTKZLRNMMJFGPD-NSKWMCEGSA-N
Data  3 IC50
  Tab Delimited (TSV)   2D SDfile   Computed 3D by Vconf -m prep SDfile
Find this compound or compounds like it in BindingDB:
Activity Spreadsheet -- Enzyme Inhibition Constant Data from BindingDB
Found 3 hits for monomerid = 50190132
TargetHepatocyte growth factor receptor(Homo sapiens (Human))
Shanghai University Of Traditional Chinese Medicine
Curated by ChEMBL
LigandPNGBDBM50190132(CHEMBL3828225)
Affinity DataIC50: >2.00E+4nM. Assay description: Inhibition of c-MET (unknown origin) by caliper mobility shift assay
In DepthDetails ArticlePubMed
TargetNAD-dependent protein deacetylase sirtuin-2(Homo sapiens (Human))
Guru Jambheshwar University Of Science And Technology
Curated by ChEMBL
LigandPNGBDBM50190132(CHEMBL3828225)
Affinity DataIC50:  2.20E+4nM. Assay description: Inhibition of recombinant human GST-tagged SIRT2 overexpressed in Escherichia coli DH5alpha assessed as deacetylation activity using [3H]-MPSDKTIGG a...
In DepthDetails ArticlePubMed
TargetNAD-dependent protein deacetylase sirtuin-1(Homo sapiens (Human))
Guru Jambheshwar University Of Science And Technology
Curated by ChEMBL
LigandPNGBDBM50190132(CHEMBL3828225)
Affinity DataIC50:  9.00E+3nM. Assay description: Inhibition of recombinant human GST-tagged SIRT1 overexpressed in Escherichia coli DH5alpha assessed as deacetylation activity using [3H]-MPSDKTIGG a...
In DepthDetails ArticlePubMed