BDBM50190494 CHEMBL209303::N-(3,5-diamino-6-chloropyrazine-2-carbony)-N'-{4-[4-(2(R)-2,3-dihydroxy-propoxy)phenyl]butyl}guanidine
SMILES NC(NC(=O)c1nc(Cl)c(N)nc1N)=NCCCCc1ccc(OC[C@H](O)CO)cc1
InChI Key InChIKey=NTRKMGDUWYBLMS-GFCCVEGCSA-N
Data  1 IC50
  Tab Delimited (TSV)   2D SDfile   Computed 3D by Vconf -m prep SDfile
Find this compound or compounds like it in BindingDB:
Activity Spreadsheet -- Enzyme Inhibition Constant Data from BindingDB
Found 1 hit for monomerid = 50190494
TargetAmiloride-sensitive sodium channel subunit alpha(Homo sapiens (Human))
Parion Sciences
Curated by ChEMBL
LigandPNGBDBM50190494(CHEMBL209303 | N-(3,5-diamino-6-chloropyrazine-2-c...)
Affinity DataIC50:  9nM. Assay description: Inhibition of dog bronchi prototypical epithelial sodium channel by electrophysiological assay
In DepthDetails ArticlePubMed