BDBM50190996 (S)-1-(4-(2-(1-amino-3-methylbutyl)-4-(trifluoromethyl)phenyl)piperazin-1-yl)-2-(phenylamino)ethanone::CHEMBL214560
SMILES CC(C)C[C@H](N)c1cc(ccc1N1CCN(CC1)C(=O)CNc1ccccc1)C(F)(F)F
InChI Key InChIKey=DYMJWDDZBWQCAB-NRFANRHFSA-N
Data  1 KI
  Tab Delimited (TSV)   2D SDfile   Computed 3D by Vconf -m prep SDfile
Find this compound or compounds like it in BindingDB:
Activity Spreadsheet -- Enzyme Inhibition Constant Data from BindingDB
Found 1 hit for monomerid = 50190996
TargetMelanocortin receptor 4(Homo sapiens (Human))
Neurocrine Biosciences
Curated by ChEMBL
LigandPNGBDBM50190996((S)-1-(4-(2-(1-amino-3-methylbutyl)-4-(trifluorome...)
Affinity DataKi:  3.60E+3nM. Assay description: Displacement of [125I]NDP-MSH from human MC4R stably expressed in HEK293 cells
In DepthDetails ArticlePubMed