BDBM50191126 3-chloro-N-(3-(6-methylpyridin-2-yl)prop-2-ynyl)benzamide::CHEMBL215748
SMILES Cc1cccc(n1)C#CCNC(=O)c1cccc(Cl)c1
InChI Key InChIKey=SHRIOHIVCFTIJL-UHFFFAOYSA-N
Data  1 IC50
  Tab Delimited (TSV)   2D SDfile   Computed 3D by Vconf -m prep SDfile
Find this compound or compounds like it in BindingDB:
Activity Spreadsheet -- Enzyme Inhibition Constant Data from BindingDB
Found 1 hit for monomerid = 50191126
TargetMetabotropic glutamate receptor 5(Homo sapiens (Human))
Astrazeneca R&D MöLndal
Curated by ChEMBL
LigandPNGBDBM50191126(3-chloro-N-(3-(6-methylpyridin-2-yl)prop-2-ynyl)be...)
Affinity DataIC50:  2.61E+3nM. Assay description: Activity at human mGluR5d assessed as inhibition of glutamate-induced calcium influx by FLIPR assay
In DepthDetails ArticlePubMed