BDBM50191690 CHEMBL214860::norflavaspidic acid-AB
SMILES CCCC(=O)c1c(O)cc(O)c(CC2C(=O)C(C(C)=O)C(=O)C(C)(C)C2=O)c1O
InChI Key InChIKey=ZNPQBLOHBHIMRJ-UHFFFAOYSA-N
Data  1 IC50
  Tab Delimited (TSV)   2D SDfile   Computed 3D by Vconf -m prep SDfile
Find this compound or compounds like it in BindingDB:
Activity Spreadsheet -- Enzyme Inhibition Constant Data from BindingDB
Found 1 hit for monomerid = 50191690
TargetFatty acid synthase(Homo sapiens (Human))
Korea Research Institute Of Bioscience And Biotechnology
Curated by ChEMBL
LigandPNGBDBM50191690(CHEMBL214860 | norflavaspidic acid-AB)
Affinity DataIC50:  2.97E+4nM. Assay description: Inhibition of FAS
In DepthDetails ArticlePubMed