BDBM50192091 CHEMBL215215::cis-5-benzyl-N-cyclohexyl-6-oxomorpholine-3-carboxamide
SMILES O=C(NC1CCCCC1)[C@@H]1COC(=O)[C@H](Cc2ccccc2)N1
InChI Key InChIKey=JBQUJNWFGSSCHH-HOTGVXAUSA-N
Data  1 IC50
  Tab Delimited (TSV)   2D SDfile   Computed 3D by Vconf -m prep SDfile
Find this compound or compounds like it in BindingDB:
Activity Spreadsheet -- Enzyme Inhibition Constant Data from BindingDB
Found 1 hit for monomerid = 50192091
TargetVoltage-dependent T-type calcium channel subunit alpha-1G(Homo sapiens (Human))
Institute Of Science And Technology
Curated by ChEMBL
LigandPNGBDBM50192091(CHEMBL215215 | cis-5-benzyl-N-cyclohexyl-6-oxomorp...)
Affinity DataIC50:  2.18E+3nM. Assay description: Ability to block calcium channel T type 3.1v expressed in HEK293 cells by whole cell patch clamp method
In DepthDetails ArticlePubMed