BDBM50192092 CHEMBL384620::cis-N-benzyl-5-((R)-sec-butyl)-6-oxomorpholine-3-carboxamide
SMILES CCC(C)[C@@H]1N[C@@H](COC1=O)C(=O)NCc1ccccc1
InChI Key InChIKey=XCVAPGUOULEGBH-VNXPTHQBSA-N
Data  1 IC50
  Tab Delimited (TSV)   2D SDfile   Computed 3D by Vconf -m prep SDfile
Find this compound or compounds like it in BindingDB:
Activity Spreadsheet -- Enzyme Inhibition Constant Data from BindingDB
Found 1 hit for monomerid = 50192092
TargetVoltage-dependent T-type calcium channel subunit alpha-1G(Homo sapiens (Human))
Institute Of Science And Technology
Curated by ChEMBL
LigandPNGBDBM50192092(CHEMBL384620 | cis-N-benzyl-5-((R)-sec-butyl)-6-ox...)
Affinity DataIC50:  1.22E+3nM. Assay description: Ability to block calcium channel T type 3.1v expressed in HEK293 cells by whole cell patch clamp method
In DepthDetails ArticlePubMed