BDBM50192608 (5-(3-fluorophenyl)-1-pentyl-1H-pyrrol-3-yl)(naphthalen-1-yl)methanone::CHEMBL220304::JWH-368
SMILES CCCCCn1cc(cc1-c1cccc(F)c1)C(=O)c1cccc2ccccc12
InChI Key InChIKey=OCOICOMCAJNSCA-UHFFFAOYSA-N
Data  2 KI
  Tab Delimited (TSV)   2D SDfile   Computed 3D by Vconf -m prep SDfile
Find this compound or compounds like it in BindingDB:
Activity Spreadsheet -- Enzyme Inhibition Constant Data from BindingDB
Found 2 hits for monomerid = 50192608
TargetCannabinoid receptor 2(Homo sapiens (Human))
Clemson University
Curated by ChEMBL
LigandPNGBDBM50192608((5-(3-fluorophenyl)-1-pentyl-1H-pyrrol-3-yl)(napht...)
Affinity DataKi:  9.10nM. Assay description: Displacement of [3H]CP 55940 from human cloned CB2 receptor
In DepthDetails ArticlePubMed
TargetCannabinoid receptor 1(Rattus norvegicus (rat))
Clemson University
Curated by ChEMBL
LigandPNGBDBM50192608((5-(3-fluorophenyl)-1-pentyl-1H-pyrrol-3-yl)(napht...)
Affinity DataKi:  16nM. Assay description: Displacement of [3H]CP 55940 from CB1 receptor in rat brain
In DepthDetails ArticlePubMed