BDBM50193081 CHEMBL271761
SMILES Brc1ccc2c3CC(C(=O)Oc3ccc2c1)c1ccccc1
InChI Key InChIKey=KNCWGGDYISFPIT-UHFFFAOYSA-N
Data  1 IC50
  Tab Delimited (TSV)   2D SDfile   Computed 3D by Vconf -m prep SDfile
Find this compound or compounds like it in BindingDB:
Activity Spreadsheet -- Enzyme Inhibition Constant Data from BindingDB
Found 1 hit for monomerid = 50193081
TargetNAD-dependent protein deacetylase sirtuin-1(Homo sapiens (Human))
Guru Jambheshwar University Of Science And Technology
Curated by ChEMBL
LigandPNGBDBM50193081(CHEMBL271761)
Affinity DataIC50:  5.00E+3nM. Assay description: Inhibition of human FLAG-tagged SIRT1 expressed in HEK293 cells using [3H]-H3 peptide as substrate
In DepthDetails ArticlePubMed