BDBM50193149 ({4-[(5'R,11'S,24'R,30'S)-11',30'-bis(carbamoylmethyl)-3',6',9',12',22',25',28',31'-octaoxo-24'-{[4-(phosphonomethyl)phenyl]methyl}dispiro[cyclohexane-1,8'-[1,4,7,10,13,18,19,20,23,26,29,32,37,38]tetradecaazatricyclo[34.2.1.1^{17,20}]tetracontane-27',1''-cyclohexane]-17'(40'),18',36'(39'),37'-tetraen-5'-ylmethyl]phenyl}methyl)phosphonic acid::CHEMBL385364
SMILES NC(=O)C[C@@H]1NC(=O)C2(CCCCC2)NC(=O)[C@@H](Cc2ccc(CP(O)(O)=O)cc2)NC(=O)Cn2cc(CCCNC(=O)[C@H](CC(N)=O)NC(=O)C3(CCCCC3)NC(=O)[C@@H](Cc3ccc(CP(O)(O)=O)cc3)NC(=O)Cn3cc(CCCNC1=O)nn3)nn2
InChI Key InChIKey=FGRLLBKQHNTRTQ-QHQGJXSCSA-N
Data  1 Kd
  Tab Delimited (TSV)   2D SDfile   Computed 3D by Vconf -m prep SDfile
Find this compound or compounds like it in BindingDB:
Activity Spreadsheet -- Enzyme Inhibition Constant Data from BindingDB
Found 1 hit for monomerid = 50193149
TargetGrowth factor receptor-bound protein 2(Homo sapiens (Human))
Nih
Curated by ChEMBL
LigandPNGBDBM50193149(({4-[(5'R,11'S,24'R,30'S)-11',30'-bis(carbamoylmet...)
Affinity DataKd: >1.00E+3nM. Assay description: Binding affinity to Grb2-SH2 domain
In DepthDetails ArticlePubMed