BDBM501934 US11028075, Example 67
SMILES CN(C)[C@H]1C[C@H](CC[C@@H]1Oc1cc(F)c(cc1Cl)S(=O)(=O)Nc1ccncn1)c1ccc(Cl)c(Cl)c1
InChI Key InChIKey=BVSVUYIBNWFURW-JHVJFLLYSA-N
Data  2 IC50
  Tab Delimited (TSV)   2D SDfile   Computed 3D by Vconf -m prep SDfile
Find this compound or compounds like it in BindingDB:
Activity Spreadsheet -- Enzyme Inhibition Constant Data from BindingDB
Found 2 hits for monomerid = 501934
TargetSodium channel protein type 9 subunit alpha(Homo sapiens (Human))
Genentech
US Patent
LigandPNGBDBM501934(US11028075, Example 67)
Affinity DataIC50:  0.325nM. Assay description: The following voltage clamp electrophysiology studies are performed on representative compounds using cells heterologously expressing Nav1.7 or Nav1....
Ligand InfoPC cidPC sid
In DepthDetails US Patent
TargetSodium channel protein type 9 subunit alpha(Homo sapiens (Human))
Genentech
US Patent
LigandPNGBDBM501934(US11028075, Example 67)
Affinity DataIC50:  3.83nM. Assay description: Saturation experiments. A competitive NaV1.7 inhibitor having a methyl group is tritiated. Three tritiums are incorporated in place of methyl hydroge...
Ligand InfoPC cidPC sid
In DepthDetails US Patent