BDBM50193623 (E)-N-(4-amino-2-propylquinolin-6-yl)-3-(2-chlorophenyl)acrylamide::CHEMBL216342
SMILES CCCc1cc(N)c2cc(NC(=O)\C=C\c3ccccc3Cl)ccc2n1
InChI Key InChIKey=BIDLIOISUBBYOB-DHZHZOJOSA-N
Data  1 IC50  1 EC50
  Tab Delimited (TSV)   2D SDfile   Computed 3D by Vconf -m prep SDfile
Find this compound or compounds like it in BindingDB:
Activity Spreadsheet -- Enzyme Inhibition Constant Data from BindingDB
Found 2 hits for monomerid = 50193623
TargetMelanin-concentrating hormone receptor 1(Homo sapiens (Human))
Merck Research Laboratories
Curated by ChEMBL
LigandPNGBDBM50193623((E)-N-(4-amino-2-propylquinolin-6-yl)-3-(2-chlorop...)
Affinity DataEC50:  500nM. Assay description: Stimulation of IP3-coupled mobilization of calcium in HEK293 cells expressing MCH-R1
In DepthDetails ArticlePubMed
TargetMelanin-concentrating hormone receptor 1(Homo sapiens (Human))
Merck Research Laboratories
Curated by ChEMBL
LigandPNGBDBM50193623((E)-N-(4-amino-2-propylquinolin-6-yl)-3-(2-chlorop...)
Affinity DataIC50:  120nM. Assay description: Displacement of 125I-[Phe13,Tyr19]-MCH from human MCH-R1
In DepthDetails ArticlePubMed