BDBM50193625 2-propyl-N6-(3-(4-(trifluoromethyl)phenyl)propyl)quinoline-4,6-diamine::CHEMBL216372
SMILES CCCc1cc(N)c2cc(NCCCc3ccc(cc3)C(F)(F)F)ccc2n1
InChI Key InChIKey=WJIUPZOJOQMODR-UHFFFAOYSA-N
Data  1 IC50  1 EC50
  Tab Delimited (TSV)   2D SDfile   Computed 3D by Vconf -m prep SDfile
Find this compound or compounds like it in BindingDB:
Activity Spreadsheet -- Enzyme Inhibition Constant Data from BindingDB
Found 2 hits for monomerid = 50193625
TargetMelanin-concentrating hormone receptor 1(Homo sapiens (Human))
Merck Research Laboratories
Curated by ChEMBL
LigandPNGBDBM50193625(2-propyl-N6-(3-(4-(trifluoromethyl)phenyl)propyl)q...)
Affinity DataIC50:  180nM. Assay description: Displacement of 125I-[Phe13,Tyr19]-MCH from human MCH-R1
In DepthDetails ArticlePubMed
TargetMelanin-concentrating hormone receptor 1(Homo sapiens (Human))
Merck Research Laboratories
Curated by ChEMBL
LigandPNGBDBM50193625(2-propyl-N6-(3-(4-(trifluoromethyl)phenyl)propyl)q...)
Affinity DataEC50:  1.00E+3nM. Assay description: Stimulation of IP3-coupled mobilization of calcium in HEK293 cells expressing MCH-R1
In DepthDetails ArticlePubMed