BDBM50193635 (E)-N-(4-amino-2-cyclohexylquinolin-6-yl)-3-(4-(trifluoromethyl)phenyl)acrylamide::CHEMBL386320
SMILES Nc1cc(nc2ccc(NC(=O)\C=C\c3ccc(cc3)C(F)(F)F)cc12)C1CCCCC1
InChI Key InChIKey=HUBNHNXKNZPWEP-MDWZMJQESA-N
Data  1 IC50  1 EC50
  Tab Delimited (TSV)   2D SDfile   Computed 3D by Vconf -m prep SDfile
Find this compound or compounds like it in BindingDB:
Activity Spreadsheet -- Enzyme Inhibition Constant Data from BindingDB
Found 2 hits for monomerid = 50193635
TargetMelanin-concentrating hormone receptor 1(Homo sapiens (Human))
Merck Research Laboratories
Curated by ChEMBL
LigandPNGBDBM50193635((E)-N-(4-amino-2-cyclohexylquinolin-6-yl)-3-(4-(tr...)
Affinity DataIC50:  1.20nM. Assay description: Displacement of 125I-[Phe13,Tyr19]-MCH from human MCH-R1
In DepthDetails ArticlePubMed
TargetMelanin-concentrating hormone receptor 1(Homo sapiens (Human))
Merck Research Laboratories
Curated by ChEMBL
LigandPNGBDBM50193635((E)-N-(4-amino-2-cyclohexylquinolin-6-yl)-3-(4-(tr...)
Affinity DataEC50:  96nM. Assay description: Stimulation of IP3-coupled mobilization of calcium in HEK293 cells expressing MCH-R1
In DepthDetails ArticlePubMed