BDBM50193892 CHEMBL217961::N-(3-chlorophenyl)-7-(2,6-dimethylphenyl)-5-methylbenzo[e][1,2,4]triazin-3-amine::US8481536, 346
SMILES Cc1cccc(C)c1-c1cc(C)c2nc(Nc3cccc(Cl)c3)nnc2c1
InChI Key InChIKey=MJHIDASBEUSGFA-UHFFFAOYSA-N
Data  2 IC50
  Tab Delimited (TSV)   2D SDfile   Computed 3D by Vconf -m prep SDfile
Find this compound or compounds like it in BindingDB:
Activity Spreadsheet -- Enzyme Inhibition Constant Data from BindingDB
Found 2 hits for monomerid = 50193892
TargetProto-oncogene tyrosine-protein kinase Src(Homo sapiens (Human))
Targegen
Curated by ChEMBL
LigandPNGBDBM50193892(CHEMBL217961 | N-(3-chlorophenyl)-7-(2,6-dimethylp...)
Affinity DataIC50:  130nM. Assay description: Inhibition of human recombinant Src kinase
In DepthDetails ArticlePubMed
TargetProto-oncogene tyrosine-protein kinase Src(Homo sapiens (Human))
Targegen
Curated by ChEMBL
LigandPNGBDBM50193892(CHEMBL217961 | N-(3-chlorophenyl)-7-(2,6-dimethylp...)
Affinity DataIC50:  134nMT: 2°C. Assay description: Testing of inhibition of kinases in vitro using luciferase-based assay from KinaseGlo, Promega Corp.
In DepthDetails US Patent