BDBM50193928 3-(2-((E)-3-(2-(benzyloxy)-5-methylphenyl)prop-1-enyl)phenyl)acrylic acid::CHEMBL376053
SMILES Cc1ccc(OCc2ccccc2)c(C\C=C\c2ccccc2\C=C\C(O)=O)c1
InChI Key InChIKey=LREWFVYIDKQTCI-FLPZBXERSA-N
Data  8 KI
  Tab Delimited (TSV)   2D SDfile   Computed 3D by Vconf -m prep SDfile
Find this compound or compounds like it in BindingDB:
Activity Spreadsheet -- Enzyme Inhibition Constant Data from BindingDB
Found 8 hits for monomerid = 50193928
TargetProstaglandin E2 receptor EP3 subtype(Homo sapiens (Human))
Merck Frosst Centre For Therapeutic Research
Curated by ChEMBL
LigandPNGBDBM50193928(3-(2-((E)-3-(2-(benzyloxy)-5-methylphenyl)prop-1-e...)
Affinity DataKi:  9nM. Assay description: Binding affinity to EP3 receptor
In DepthDetails ArticlePubMed
TargetThromboxane A2 receptor(Homo sapiens (Human))
Merck Frosst Centre For Therapeutic Research
Curated by ChEMBL
LigandPNGBDBM50193928(3-(2-((E)-3-(2-(benzyloxy)-5-methylphenyl)prop-1-e...)
Affinity DataKi: >500nM. Assay description: Binding affinity to TP receptor
In DepthDetails ArticlePubMed
TargetProstaglandin D2 receptor(Homo sapiens (Human))
Merck Frosst Centre For Therapeutic Research
Curated by ChEMBL
LigandPNGBDBM50193928(3-(2-((E)-3-(2-(benzyloxy)-5-methylphenyl)prop-1-e...)
Affinity DataKi: >500nM. Assay description: Binding affinity to DP receptor
In DepthDetails ArticlePubMed
TargetProstaglandin F2-alpha receptor(Homo sapiens (Human))
Merck Frosst Centre For Therapeutic Research
Curated by ChEMBL
LigandPNGBDBM50193928(3-(2-((E)-3-(2-(benzyloxy)-5-methylphenyl)prop-1-e...)
Affinity DataKi: >500nM. Assay description: Binding affinity to FP receptor
In DepthDetails ArticlePubMed
TargetProstacyclin receptor(Homo sapiens (Human))
Merck Frosst Centre For Therapeutic Research
Curated by ChEMBL
LigandPNGBDBM50193928(3-(2-((E)-3-(2-(benzyloxy)-5-methylphenyl)prop-1-e...)
Affinity DataKi: >500nM. Assay description: Binding affinity to IP receptor
In DepthDetails ArticlePubMed
TargetProstaglandin E2 receptor EP2 subtype(Homo sapiens (Human))
Merck Frosst Centre For Therapeutic Research
Curated by ChEMBL
LigandPNGBDBM50193928(3-(2-((E)-3-(2-(benzyloxy)-5-methylphenyl)prop-1-e...)
Affinity DataKi:  860nM. Assay description: Binding affinity to EP2 receptor
In DepthDetails ArticlePubMed
TargetProstaglandin E2 receptor EP4 subtype(Homo sapiens (Human))
Merck Frosst Centre For Therapeutic Research
Curated by ChEMBL
LigandPNGBDBM50193928(3-(2-((E)-3-(2-(benzyloxy)-5-methylphenyl)prop-1-e...)
Affinity DataKi:  2.00E+3nM. Assay description: Binding affinity to EP4 receptor
In DepthDetails ArticlePubMed
TargetProstaglandin E2 receptor EP1 subtype(Homo sapiens (Human))
Merck Frosst Centre For Therapeutic Research
Curated by ChEMBL
LigandPNGBDBM50193928(3-(2-((E)-3-(2-(benzyloxy)-5-methylphenyl)prop-1-e...)
Affinity DataKi:  1.90E+4nM. Assay description: Binding affinity to EP1 receptor
In DepthDetails ArticlePubMed