BDBM50194513 CHEMBL384095::N,N-diisopropyl-4-(3-(4-methoxybenzyl)ureido)-3-phenyl-2-(pyridin-3-yl)butanamide
SMILES COc1ccc(CNC(=O)NCC(C(C(=O)N(C(C)C)C(C)C)c2cccnc2)c2ccccc2)cc1
InChI Key InChIKey=GATNGCGTIOHTPD-UHFFFAOYSA-N
Data  1 IC50
  Tab Delimited (TSV)   2D SDfile   Computed 3D by Vconf -m prep SDfile
Find this compound or compounds like it in BindingDB:
Activity Spreadsheet -- Enzyme Inhibition Constant Data from BindingDB
Found 1 hit for monomerid = 50194513
TargetPotassium voltage-gated channel subfamily A member 5(Homo sapiens (Human))
Merck Research Laboratories
Curated by ChEMBL
LigandPNGBDBM50194513(CHEMBL384095 | N,N-diisopropyl-4-(3-(4-methoxybenz...)
Affinity DataIC50:  256nM. Assay description: Inhibition of Kv1.5
In DepthDetails ArticlePubMed