BDBM50195127 (S)-2-(2-(5-methoxy-2-methyl-1H-indol-3-yl)acetamido)-8-oxo-N-(2-(2-phenyl-1H-indol-3-yl)ethyl)octanamide::CHEMBL384463
SMILES COc1ccc2[nH]c(C)c(CC(=O)N[C@@H](CCCCCC=O)C(=O)NCCc3c([nH]c4ccccc34)-c3ccccc3)c2c1
InChI Key InChIKey=LWJWEMUCBHIFPY-XIFFEERXSA-N
Data  1 IC50
  Tab Delimited (TSV)   2D SDfile   Computed 3D by Vconf -m prep SDfile
Find this compound or compounds like it in BindingDB:
Activity Spreadsheet -- Enzyme Inhibition Constant Data from BindingDB
Found 1 hit for monomerid = 50195127
TargetHistone deacetylase 1(Homo sapiens (Human))
Irbm/Merck Research Laboratories
Curated by ChEMBL
LigandPNGBDBM50195127((S)-2-(2-(5-methoxy-2-methyl-1H-indol-3-yl)acetami...)
Affinity DataIC50:  350nM. Assay description: Inhibition of HDAC1 (mean IC50)
In DepthDetails ArticlePubMed