BDBM50195202 3-(5-(piperidin-1-ylmethyl)-1H-indol-2-yl)-6-(2H-1,2,3-triazol-2-yl)quinolin-2(1H)-one::CHEMBL222006
SMILES O=c1[nH]c2ccc(cc2cc1-c1cc2cc(CN3CCCCC3)ccc2[nH]1)-n1nccn1
InChI Key InChIKey=LNJCLGSHZRMFDX-UHFFFAOYSA-N
Data  1 IC50  1 EC50
  Tab Delimited (TSV)   2D SDfile   Computed 3D by Vconf -m prep SDfile
Find this compound or compounds like it in BindingDB:
Activity Spreadsheet -- Enzyme Inhibition Constant Data from BindingDB
Found 2 hits for monomerid = 50195202
TargetSerine/threonine-protein kinase Chk1(Homo sapiens (Human))
Merck Research Laboratories
Curated by ChEMBL
LigandPNGBDBM50195202(3-(5-(piperidin-1-ylmethyl)-1H-indol-2-yl)-6-(2H-1...)
Affinity DataIC50:  14nM. Assay description: Inhibition of human CHEK1
In DepthDetails ArticlePubMed
TargetSerine/threonine-protein kinase Chk1(Homo sapiens (Human))
Merck Research Laboratories
Curated by ChEMBL
LigandPNGBDBM50195202(3-(5-(piperidin-1-ylmethyl)-1H-indol-2-yl)-6-(2H-1...)
Affinity DataEC50:  880nM. Assay description: Release of camptothecin-induced cell cycle arrest in NCI-H1299 cells mediated by CHEK1 inhibition
In DepthDetails ArticlePubMed