BDBM50195207 2-oxo-3-(5-(piperidin-1-ylmethyl)-1H-indol-2-yl)-1,2-dihydroquinoline-6-carbonitrile::CHEMBL415656
SMILES O=c1[nH]c2ccc(cc2cc1-c1cc2cc(CN3CCCCC3)ccc2[nH]1)C#N
InChI Key InChIKey=MWAPYBBXQBEQIA-UHFFFAOYSA-N
Data  1 IC50  1 EC50
  Tab Delimited (TSV)   2D SDfile   Computed 3D by Vconf -m prep SDfile
Find this compound or compounds like it in BindingDB:
Activity Spreadsheet -- Enzyme Inhibition Constant Data from BindingDB
Found 2 hits for monomerid = 50195207
TargetSerine/threonine-protein kinase Chk1(Homo sapiens (Human))
Merck Research Laboratories
Curated by ChEMBL
LigandPNGBDBM50195207(2-oxo-3-(5-(piperidin-1-ylmethyl)-1H-indol-2-yl)-1...)
Affinity DataIC50:  4.60nM. Assay description: Inhibition of human CHEK1
In DepthDetails ArticlePubMed
TargetSerine/threonine-protein kinase Chk1(Homo sapiens (Human))
Merck Research Laboratories
Curated by ChEMBL
LigandPNGBDBM50195207(2-oxo-3-(5-(piperidin-1-ylmethyl)-1H-indol-2-yl)-1...)
Affinity DataEC50:  170nM. Assay description: Release of camptothecin-induced cell cycle arrest in NCI-H1299 cells mediated by CHEK1 inhibition
In DepthDetails ArticlePubMed