BDBM50195478 CHEMBL3959081
SMILES Cc1ccc(Oc2nc3nc(c(Cl)cc3[nH]2)-c2ccc(cc2)N2CCCC2)cc1C(O)=O
InChI Key InChIKey=XNRWHVJEMDKXMM-UHFFFAOYSA-N
Data  1 EC50
  Tab Delimited (TSV)   2D SDfile   Computed 3D by Vconf -m prep SDfile
Find this compound or compounds like it in BindingDB:
Activity Spreadsheet -- Enzyme Inhibition Constant Data from BindingDB
Found 1 hit for monomerid = 50195478
LigandPNGBDBM50195478(CHEMBL3959081)
Affinity DataEC50:  1nM. Assay description: Activation of full length human recombinant AMPK alpha1/beta1/gamma1 expressed in baculovirus infected sf21 cells using 5'-FAM-SAMS peptide substrate...
In DepthDetails ArticlePubMed