BDBM50196126 (R)-{4-[4-(3,4-dimethylpiperazin-1-yl)phenylamino]-3-methylquinolin-2-yl}methanol::CHEMBL217254
SMILES C[C@@H]1CN(CCN1C)c1ccc(Nc2c(C)c(CO)nc3ccccc23)cc1
InChI Key InChIKey=CWSVSBNTQJZFGE-MRXNPFEDSA-N
Data  4 KI
  Tab Delimited (TSV)   2D SDfile   Computed 3D by Vconf -m prep SDfile
Find this compound or compounds like it in BindingDB:
Activity Spreadsheet -- Enzyme Inhibition Constant Data from BindingDB
Found 4 hits for monomerid = 50196126
TargetAlpha-2C adrenergic receptor(Homo sapiens (Human))
Timisoara Of The Romanian Academy
Curated by ChEMBL
LigandPNGBDBM50196126((R)-{4-[4-(3,4-dimethylpiperazin-1-yl)phenylamino]...)
Affinity DataKi:  9nM. Assay description: Binding affinity to human cloned Alpha-2C adrenergic receptor
In DepthDetails ArticlePubMed
TargetAlpha-2C adrenergic receptor(Homo sapiens (Human))
Timisoara Of The Romanian Academy
Curated by ChEMBL
LigandPNGBDBM50196126((R)-{4-[4-(3,4-dimethylpiperazin-1-yl)phenylamino]...)
Affinity DataKi:  9nM. Assay description: Displacement of [3H]rauwolscine from human ADRA2C expressed in S115 cells
In DepthDetails ArticlePubMed
TargetAlpha-2B adrenergic receptor(Homo sapiens (Human))
Juvantia Pharma
Curated by ChEMBL
LigandPNGBDBM50196126((R)-{4-[4-(3,4-dimethylpiperazin-1-yl)phenylamino]...)
Affinity DataKi:  1.80E+3nM. Assay description: Displacement of [3H]rauwolscine from human ADRA2B expressed in S115 cells
In DepthDetails ArticlePubMed
TargetAlpha-2A adrenergic receptor(Homo sapiens (Human))
Juvantia Pharma
Curated by ChEMBL
LigandPNGBDBM50196126((R)-{4-[4-(3,4-dimethylpiperazin-1-yl)phenylamino]...)
Affinity DataKi:  1.87E+3nM. Assay description: Displacement of [3H]rauwolscine from human ADRA2A expressed in S115 cells
In DepthDetails ArticlePubMed