BDBM50196147 (3-ethyl-2,8-dimethylquinolin-4-yl)-[4-(4-methyl-[1,4]diazepan-1-yl)phenyl]amine::CHEMBL386169
SMILES CCc1c(C)nc2c(C)cccc2c1Nc1ccc(cc1)N1CCCN(C)CC1
InChI Key InChIKey=HWDFFRKTRBIVTK-UHFFFAOYSA-N
Data  4 KI
  Tab Delimited (TSV)   2D SDfile   Computed 3D by Vconf -m prep SDfile
Find this compound or compounds like it in BindingDB:
Activity Spreadsheet -- Enzyme Inhibition Constant Data from BindingDB
Found 4 hits for monomerid = 50196147
TargetAlpha-2C adrenergic receptor(Homo sapiens (Human))
Timisoara Of The Romanian Academy
Curated by ChEMBL
LigandPNGBDBM50196147((3-ethyl-2,8-dimethylquinolin-4-yl)-[4-(4-methyl-[...)
Affinity DataKi:  8.49nM. Assay description: Binding affinity to human cloned Alpha-2C adrenergic receptor
In DepthDetails ArticlePubMed
TargetAlpha-2C adrenergic receptor(Homo sapiens (Human))
Timisoara Of The Romanian Academy
Curated by ChEMBL
LigandPNGBDBM50196147((3-ethyl-2,8-dimethylquinolin-4-yl)-[4-(4-methyl-[...)
Affinity DataKi:  8.5nM. Assay description: Displacement of [3H]rauwolscine from human ADRA2C expressed in S115 cells
In DepthDetails ArticlePubMed
TargetAlpha-2B adrenergic receptor(Homo sapiens (Human))
Juvantia Pharma
Curated by ChEMBL
LigandPNGBDBM50196147((3-ethyl-2,8-dimethylquinolin-4-yl)-[4-(4-methyl-[...)
Affinity DataKi:  2.60E+3nM. Assay description: Displacement of [3H]rauwolscine from human ADRA2B expressed in S115 cells
In DepthDetails ArticlePubMed
TargetAlpha-2A adrenergic receptor(Homo sapiens (Human))
Juvantia Pharma
Curated by ChEMBL
LigandPNGBDBM50196147((3-ethyl-2,8-dimethylquinolin-4-yl)-[4-(4-methyl-[...)
Affinity DataKi:  8.00E+3nM. Assay description: Displacement of [3H]rauwolscine from human ADRA2A expressed in S115 cells
In DepthDetails ArticlePubMed