BDBM50196734 CHEMBL409947::N-((S)-1-((2S,3R)-4-(3-ethylbenzylamino)-1-(3,5-difluorophenyl)-3-hydroxybutan-2-ylamino)-3-(butylsulfonyl)-1-oxopropan-2-yl)-5-methyl-1H-pyrazole-3-carboxamide
SMILES CCCCS(=O)(=O)C[C@@H](NC(=O)c1cc(C)n[nH]1)C(=O)N[C@@H](Cc1cc(F)cc(F)c1)[C@H](O)CNCc1cccc(CC)c1
InChI Key InChIKey=HEINWAWHFFDZOZ-WIIGKZCBSA-N
Data  2 IC50  1 EC50
  Tab Delimited (TSV)   2D SDfile   Computed 3D by Vconf -m prep SDfile
Find this compound or compounds like it in BindingDB:
Activity Spreadsheet -- Enzyme Inhibition Constant Data from BindingDB
Found 3 hits for monomerid = 50196734
TargetBeta-secretase 1(Homo sapiens (Human))
Pfizer
Curated by ChEMBL
LigandPNGBDBM50196734(CHEMBL409947 | N-((S)-1-((2S,3R)-4-(3-ethylbenzyla...)
Affinity DataIC50:  4nM. Assay description: Inhibition of BACE
In DepthDetails ArticlePubMed
TargetCathepsin B(Homo sapiens (Human))
Pfizer
Curated by ChEMBL
LigandPNGBDBM50196734(CHEMBL409947 | N-((S)-1-((2S,3R)-4-(3-ethylbenzyla...)
Affinity DataIC50:  341nM. Assay description: Inhibition of cathepsin D
In DepthDetails ArticlePubMed
TargetBeta-secretase 1(Homo sapiens (Human))
Pfizer
Curated by ChEMBL
LigandPNGBDBM50196734(CHEMBL409947 | N-((S)-1-((2S,3R)-4-(3-ethylbenzyla...)
Affinity DataEC50:  4nM. Assay description: Inhibition of BACE expressed in HEK293 cells
In DepthDetails ArticlePubMed