BDBM50197286 CHEMBL3965048
SMILES Cc1cc(ccn1)-c1ncc(CNC(=O)c2ccc3-c4ccccc4C(=O)c3c2)cc1F
InChI Key InChIKey=STHPNWUOZLNVMR-UHFFFAOYSA-N
Data  1 IC50
  Tab Delimited (TSV)   2D SDfile   Computed 3D by Vconf -m prep SDfile
Find this compound or compounds like it in BindingDB:
Activity Spreadsheet -- Enzyme Inhibition Constant Data from BindingDB
Found 1 hit for monomerid = 50197286
TargetProtein-serine O-palmitoleoyltransferase porcupine(Mus musculus)
Soochow University
Curated by ChEMBL
LigandPNGBDBM50197286(CHEMBL3965048)
Affinity DataIC50:  44nM. Assay description: Inhibition of porcupine in mouse L Wnt3A cells co-cultured with HEK293 cells after 48 hrs by Super-top flash reporter gene assay
In DepthDetails ArticlePubMed