BDBM50198343 CHEMBL3965046
SMILES CCN1CCN(CC1)C1CCN(CC1)C(=O)COc1ccc(cc1)-c1ccccc1
InChI Key InChIKey=BODMOCLWYAYDCG-UHFFFAOYSA-N
Data  7 IC50
PDB links: 1 PDB ID matches this monomer.
  Tab Delimited (TSV)   2D SDfile   Computed 3D by Vconf -m prep SDfile
Find this compound or compounds like it in BindingDB:
Activity Spreadsheet -- Enzyme Inhibition Constant Data from BindingDB
Found 7 hits for monomerid = 50198343
TargetAcetylcholinesterase(Anopheles gambiae)
Ume£
Curated by ChEMBL
LigandPNGBDBM50198343(CHEMBL3965046)
Affinity DataIC50:  210nM. Assay description: Inhibition of Anopheles gambiae recombinant AChE1 expressed in baculovirus infected insect Sf9 cells using acetylthiocholine iodide as substrate meas...
In DepthDetails ArticlePubMed
TargetAcetylcholinesterase(Homo sapiens (Human))
Ume£
Curated by ChEMBL
LigandPNGBDBM50198343(CHEMBL3965046)
Affinity DataIC50:  3.10E+4nM. Assay description: Inhibition of human recombinant AChE using acetylthiocholine iodide as substrate measured over 60 secs by Ellman assay
TargetAcetylcholinesterase(Mus musculus (mouse))
Ume£
Curated by ChEMBL
LigandPNGBDBM50198343(CHEMBL3965046)
Affinity DataIC50:  1.80E+4nM. Assay description: Inhibition of mouse recombinant AChE using acetylthiocholine iodide as substrate measured over 60 secs by Ellman assay
TargetAcetylcholinesterase(Homo sapiens (Human))
Ume£
Curated by ChEMBL
LigandPNGBDBM50198343(CHEMBL3965046)
Affinity DataIC50:  3.10E+4nM. Assay description: Inhibition of recombinant human AChE using acetylthiocholine iodide as substrate measured over 60 secs by Ellman assay
TargetAcetylcholinesterase(Anopheles gambiae)
Ume£
Curated by ChEMBL
LigandPNGBDBM50198343(CHEMBL3965046)
Affinity DataIC50:  210nM. Assay description: Inhibition of recombinant Anopheles gambiae AChE1 expressed in sf9 insect cells using acetylthiocholine iodide as substrate measured over 60 secs by ...
In DepthDetails ArticlePubMed
TargetAcetylcholinesterase(Aedes aegypti)
Umea University
Curated by ChEMBL
LigandPNGBDBM50198343(CHEMBL3965046)
Affinity DataIC50:  220nM. Assay description: Inhibition of recombinant Aedes aegypti AChE1 expressed in sf9 insect cells using acetylthiocholine iodide as substrate measured over 60 secs by Ellm...
In DepthDetails ArticlePubMed
TargetAcetylcholinesterase(Anopheles gambiae)
Ume£
Curated by ChEMBL
LigandPNGBDBM50198343(CHEMBL3965046)
Affinity DataIC50:  1.30E+3nM. Assay description: Inhibition of recombinant Anopheles gambiae AChE1 G122S mutant expressed in sf9 insect cells using acetylthiocholine iodide as substrate measured ove...
In DepthDetails ArticlePubMed