BDBM50198788 CHEMBL231235::N-(4-(7-(2,6-dimethylphenyl)-5-methylbenzo[e][1,2,4]triazin-3-ylamino)phenyl)-N-(2-(pyrrolidin-1-yl)ethyl)benzamide
SMILES Cc1cccc(C)c1-c1cc(C)c2nc(Nc3ccc(cc3)N(CCN3CCCC3)C(=O)c3ccccc3)nnc2c1
InChI Key InChIKey=BOTCEXZBULNTQA-UHFFFAOYSA-N
Data  1 IC50
  Tab Delimited (TSV)   2D SDfile   Computed 3D by Vconf -m prep SDfile
Find this compound or compounds like it in BindingDB:
Activity Spreadsheet -- Enzyme Inhibition Constant Data from BindingDB
Found 1 hit for monomerid = 50198788
TargetProto-oncogene tyrosine-protein kinase Src(Homo sapiens (Human))
Targegen
Curated by ChEMBL
LigandPNGBDBM50198788(CHEMBL231235 | N-(4-(7-(2,6-dimethylphenyl)-5-meth...)
Affinity DataIC50:  16nM. Assay description: Inhibition of Src
In DepthDetails ArticlePubMed