BDBM50198803 7-(2,6-dimethylphenyl)-N-(4-(2-(pyrrolidin-1-yl)ethoxy)phenyl)benzo[e][1,2,4]triazin-3-amine::CHEMBL230999::US8481536, 323
SMILES Cc1cccc(C)c1-c1ccc2nc(Nc3ccc(OCCN4CCCC4)cc3)nnc2c1
InChI Key InChIKey=FHBKZYNVNRKEKF-UHFFFAOYSA-N
Data  2 IC50
  Tab Delimited (TSV)   2D SDfile   Computed 3D by Vconf -m prep SDfile
Find this compound or compounds like it in BindingDB:
Activity Spreadsheet -- Enzyme Inhibition Constant Data from BindingDB
Found 2 hits for monomerid = 50198803
TargetProto-oncogene tyrosine-protein kinase Src(Homo sapiens (Human))
Targegen
Curated by ChEMBL
LigandPNGBDBM50198803(7-(2,6-dimethylphenyl)-N-(4-(2-(pyrrolidin-1-yl)et...)
Affinity DataIC50:  15nM. Assay description: Inhibition of Src
In DepthDetails ArticlePubMed
TargetProto-oncogene tyrosine-protein kinase Src(Homo sapiens (Human))
Targegen
Curated by ChEMBL
LigandPNGBDBM50198803(7-(2,6-dimethylphenyl)-N-(4-(2-(pyrrolidin-1-yl)et...)
Affinity DataIC50:  15nMT: 2°C. Assay description: Testing of inhibition of kinases in vitro using luciferase-based assay from KinaseGlo, Promega Corp.
In DepthDetails US Patent