BDBM50199266 6-(4-chlorophenyl)-3-[6-(1-piperidinylmethyl)-2-naphthalenyl]thieno[3,2-d]pyrimidin-4(3H)-one::CHEMBL214523
SMILES Clc1ccc(cc1)-c1cc2ncn(-c3ccc4cc(CN5CCCCC5)ccc4c3)c(=O)c2s1
InChI Key InChIKey=FJPBPFUKHDZYIJ-UHFFFAOYSA-N
Data  1 IC50
  Tab Delimited (TSV)   2D SDfile   Computed 3D by Vconf -m prep SDfile
Find this compound or compounds like it in BindingDB:
Activity Spreadsheet -- Enzyme Inhibition Constant Data from BindingDB
Found 1 hit for monomerid = 50199266
TargetMelanin-concentrating hormone receptor 1(Homo sapiens (Human))
Glaxosmithkline
Curated by ChEMBL
LigandPNGBDBM50199266(6-(4-chlorophenyl)-3-[6-(1-piperidinylmethyl)-2-na...)
Affinity DataIC50:  0.390nM. Assay description: Antagonist activity against human MCH1 receptor stably-expressed in CHO cells by Gal4/Elk1-Luc reporter assay
In DepthDetails ArticlePubMed