BDBM50199592 4-(4-chlorophenyl)-7-(3-(4-fluoropiperidin-1-yl)propoxy)-2-methyl-1,2,3,4-tetrahydroisoquinoline::CHEMBL246332
SMILES CN1CC(c2ccc(Cl)cc2)c2ccc(OCCCN3CCC(F)CC3)cc2C1
InChI Key InChIKey=IBDXBPHXQDUOAO-UHFFFAOYSA-N
Data  3 KI
  Tab Delimited (TSV)   2D SDfile   Computed 3D by Vconf -m prep SDfile
Find this compound or compounds like it in BindingDB:
Activity Spreadsheet -- Enzyme Inhibition Constant Data from BindingDB
Found 3 hits for monomerid = 50199592
TargetHistamine H3 receptor(Homo sapiens (Human))
Johnson & Johnson Pharmaceutical Research And Development
Curated by ChEMBL
LigandPNGBDBM50199592(4-(4-chlorophenyl)-7-(3-(4-fluoropiperidin-1-yl)pr...)
Affinity DataKi:  8.30nM. Assay description: Binding affinity at human histamine H3 receptor
In DepthDetails ArticlePubMed
TargetSodium-dependent serotonin transporter(Homo sapiens (Human))
Johnson & Johnson Pharmaceutical Research And Development
Curated by ChEMBL
LigandPNGBDBM50199592(4-(4-chlorophenyl)-7-(3-(4-fluoropiperidin-1-yl)pr...)
Affinity DataKi:  11nM. Assay description: Binding affinity at human SERT
In DepthDetails ArticlePubMed
TargetSodium-dependent serotonin transporter(Rattus norvegicus (rat))
Johnson & Johnson Pharmaceutical Research And Development
Curated by ChEMBL
LigandPNGBDBM50199592(4-(4-chlorophenyl)-7-(3-(4-fluoropiperidin-1-yl)pr...)
Affinity DataKi:  16nM. Assay description: Binding affinity at rat SERT
In DepthDetails ArticlePubMed